28Mar2014 - detailed test results for StoryText - version unix
(To start TextTest for these tests, run 'texttest -a storytext -v unix -c /usr/local/tt-env -d /carm/proj/texttest/Testing/Automatic')
unix: 532 tests: 529 succeeded 2 FAILED 1 killed
Detailed information for the tests that FAILED:
2 TESTS FAILED on kilimanjaro :
---------- Differences in output ----------
13c13
< Expected application event 'rows to be added' occurred, proceeding.
---
> ERROR: Expected application event 'rows to be added' timed out after 60 seconds! Trying to proceed.
---------- Differences in recorded_usecase ----------
1,2d0
< wait for rows to be added
< # Make sure this comment gets placed correctly
3a2
> # Make sure this comment gets placed correctly
swt appevents event_data_is_category (
Last six runs
Apr2014
Mar2014
Feb2014
)
swt appevents repeat_event (
Last six runs
Apr2014
Mar2014
Feb2014
)
Detailed information for the tests that were terminated before completion:
TEST were terminated before completion (TIMEOUT) on kigoma : swt coolbar (
Last six runs
Apr2014
Mar2014
Feb2014
)
Test exceeded wallclock time limit of 300.0 seconds
---------- Differences in output ----------
1,39d0
<
< ---------- Shell '' ----------
< Cool Bar:
< Button 'Button 0'
<
< Button 'Button 1'
<
< Button 'Button 2'
<
< ------------------------------
<
< 'press button 0' event created with arguments ''
<
< Updated Cool Bar (red&) :
< Button 'Button 0'
<
< Button 'Button 1'
<
< Button 'Button 2'
<
< 'press button 1' event created with arguments ''
<
< Updated Cool Bar (dark_red) :
< Button 'Button 0'
<
< Button 'Button 1'
<
< Button 'Button 2'
<
<truncated after showing first 30 lines>
---------- Differences in recorded_usecase ----------
1,4c1
< press button 0
< press button 1
< press button 2
< close window
---
> receive signal SIGINT